β-HIMACHALENOXIDE

Normal alkane RI, polar column, custom temperature program

Data compiled by: NIST Mass Spectrometry Data Center, William E. Wallace, director

Column type Capillary
Active phase HP-Innowax FSC
Column length (m) 60.
Carrier gas
Substrate
Column diameter (mm) 0.25
Phase thickness (μm) 0.25
Program 60C(10min) => 4C/min => 220C (10min) => 1C/min => 240C
I 2045.
ReferenceTabanca, Demirci, et al., 2006
Comment MSDC-RI

References

Tabanca, Demirci, et al., 2006
Tabanca, N.; Demirci, B.; Ozek, T.; Kirimer, N.; Can Baser, K.H.; Bedir, E.; Khan, I.A.; Wedge, D.E., Gas chromatographic-mass spectrometric analysis of essential oils from Pimpinella species gathered from Central and Northern Turkey, J. Chromatogr. A, 2006, 1117, 2, 194-205, https://doi.org/10.1016/j.chroma.2006.03.075 . [all data]