γ-HIMACHALENE

Kovats' RI, polar column, isothermal

Data compiled by: NIST Mass Spectrometry Data Center, William E. Wallace, director

Column type PackedPackedPacked
Active phase Carbowax 20MCarbowax 20MCarbowax 20M
Column length (m) 7.37.37.3
Carrier gas
Substrate
Column diameter (mm)
Phase thickness (μm)
Temperature (C) 150.150.165.
I 1723.1725.1737.
ReferenceAndersen, Bissonette, et al., 1977Andersen, Bissonette, et al., 1977Andersen, Bissonette, et al., 1977
Comment MSDC-RI MSDC-RI MSDC-RI

Van Den Dool and Kratz RI, non-polar column, temperature ramp

Data compiled by: NIST Mass Spectrometry Data Center, William E. Wallace, director

Column type CapillaryCapillaryCapillaryCapillaryCapillary
Active phase HP-5MSZB-5RTX-1DB-5HP-5
Column length (m) 30.30.60.30.30.
Carrier gas HeHeHeHeN2
Substrate
Column diameter (mm) 0.250.250.220.250.25
Phase thickness (μm) 0.250.250.250.250.25
Tstart (C) 60.50.60.50.60.
Tend (C) 250.250.230.250.220.
Heat rate (K/min) 2.3.2.5.5.
Initial hold (min) 8.  2.10.
Final hold (min) 30. 45.
I 1468.1474.1479.1483.1479.
ReferenceBenkaci-Ali, Baaliouamer, et al., 2007Simoniatto, Bonani, et al., 2007Cavalli, Tomi, et al., 2006Su, Ho, et al., 2006Flamini, Luigi Cioni, et al., 2003
Comment MSDC-RI MSDC-RI MSDC-RI MSDC-RI MSDC-RI
Column type CapillaryCapillaryCapillaryCapillary
Active phase DB-5DB-5DB-5DB-5
Column length (m) 30.30.30.30.
Carrier gas HeHeHeHe
Substrate
Column diameter (mm) 0.250.250.250.25
Phase thickness (μm) 0.250.250.250.25
Tstart (C) 60.60.60.60.
Tend (C) 240.240.240.240.
Heat rate (K/min) 3.3.3.3.
Initial hold (min) 2.2.2.2.
Final hold (min)
I 1477.1477.1477.1477.
ReferenceMaia, de Paula, et al., 2000Maia, de Paula, et al., 2000Maia, de Paula, et al., 2000Maia, de Paula, et al., 2000
Comment MSDC-RI MSDC-RI MSDC-RI MSDC-RI

References

Andersen, Bissonette, et al., 1977
Andersen, N.H.; Bissonette, P.; Liu, C.-B.; Shunk, B.; Ohta, Y.; Tseng, C.-L.W.; Moore, A.; Huneck, S., Sesquiterpenes of nine European liverworts from the genera, Anastrepta, Bazzania, Jungermannia, Lepidozia, and Scapania, Phytochemistry, 1977, 16, 11, 1731-1751, https://doi.org/10.1016/0031-9422(71)85081-1 . [all data]