trans-p-Mentha-2,8-dienol

Normal alkane RI, non-polar column, temperature ramp

View large format table.

Column type Active phase I Reference Comment
CapillaryDB-5 MS1078.Patil, Jayaprakasha, et al., 200960. m/0.25 mm/0.25 μm, Helium, 40. C @ 12. min, 2. K/min, 330. C @ 30. min

Normal alkane RI, non-polar column, custom temperature program

View large format table.

Column type Active phase I Reference Comment
Capillary5 % Phenyl methyl siloxane1131.Huang, Qin, et al., 200930. m/0.25 mm/0.25 μm, Helium; Program: 50 0C (2 min) 10 0C/min -> 150 0C 15 0C/min -> 300 0C (10 min)
CapillaryHP-5MS1118.Ning, Zheng, et al., 200830. m/0.25 mm/0.25 μm, He; Program: 40 0C (2 min) 3 0C/min -> 180 0C (2 min) 15 0C -> 280 0C
CapillaryDB-51113.Hamm, Bleton, et al., 200530. m/0.25 mm/0.25 μm, He; Program: 40C(1min) => 9C/min => 130C => 2C/min => 230C

References

Patil, Jayaprakasha, et al., 2009
Patil, J.R.; Jayaprakasha, G.K.; Murthy, K.N.C.; Tichy, S.E.; Chetti, M.B.; Patil, B.S., Apoptosis-mediated proliferation inhibition of human colon cancer cells by volatile principles of Citrus auratifolia, Food Chem., 2009, 114, 4, 1351-1358, https://doi.org/10.1016/j.foodchem.2008.11.033 . [all data]

Huang, Qin, et al., 2009
Huang, B.; Qin, L.; Chu, Q.; Zhang, Q.; Gao, L.; Zheng, H., Comparison of headspace SPME with hydrodistillation and SFE for analysis of the volatile components of the roots of Valeriana officinalis var. latifolia, Chromatographia, 2009, 69, 5/6, 489-496, https://doi.org/10.1365/s10337-008-0921-y . [all data]

Ning, Zheng, et al., 2008
Ning, H.; Zheng, F.; Sun, B.; Xie, J.; Liu, Y., Solvent-free microwave extraction of essential oil from Zanthoxylum bungeanum Maxim., Food Environ. Ind. (Chinese), 2008, 34, 5, 179-184. [all data]

Hamm, Bleton, et al., 2005
Hamm, S.; Bleton, J.; Connan, J.; Tchapla, A., A chemical investigation by headspace SPME and GC-MS of volatile and semi-volatile terpenes in various olibanum samples, Phytochemistry, 2005, 66, 12, 1499-1514, https://doi.org/10.1016/j.phytochem.2005.04.025 . [all data]