cis-3-Hexenoic acid

Normal alkane RI, polar column, temperature ramp

Data compiled by: NIST Mass Spectrometry Data Center, William E. Wallace, director

Column type Capillary
Active phase DB-Wax
Column length (m) 30.
Carrier gas Helium
Substrate
Column diameter (mm) 0.25
Phase thickness (μm) 0.25
Tstart (C) 40.
Tend (C) 210.
Heat rate (K/min) 3.
Initial hold (min)
Final hold (min)
I 1936.
ReferenceKumazawa, Sakai, et al., 2010
Comment MSDC-RI

References

Kumazawa, Sakai, et al., 2010
Kumazawa, K.; Sakai, N.; Amma, H.; Sakamoto, S.; Kodama, M.; Wada, Y.; Nishimura, O., Identification and formation of volatile components responsible for the characteristic aroma of Mat Rush (Igusa), Biosci. Biotechnol. Biochem., 2010, 74, 6, 1231-1236, https://doi.org/10.1271/bbb.100053 . [all data]