4-Decenoic acid, ethyl ester

Kovats' RI, polar column, temperature ramp

Data compiled by: NIST Mass Spectrometry Data Center, William E. Wallace, director

Column type CapillaryCapillary
Active phase SupelcowaxCarbowax 20M
Column length (m) 30.50.
Carrier gas  He
Substrate
Column diameter (mm) 0.250.28
Phase thickness (μm) 0.25
Tstart (C) 60.70.
Tend (C) 240.190.
Heat rate (K/min) 3.2.
Initial hold (min) 5.
Final hold (min) 10.
I 1657.1682.
ReferenceRiu-Aumatell, Castellari, et al., 2004Tressl, Friese, et al., 1978
Comment MSDC-RI MSDC-RI

References

Riu-Aumatell, Castellari, et al., 2004
Riu-Aumatell, M.; Castellari, M.; López-Tamames, E.; Galassi, S.; Buxaderas, S., Characterisation of volatile compounds of fruit juices and nectars by HS/SPME and GC/MS, Food Chem., 2004, 87, 4, 627-637, https://doi.org/10.1016/j.foodchem.2003.12.033 . [all data]

Tressl, Friese, et al., 1978
Tressl, R.; Friese, L.; Fendesack, F.; Köppler, H., Gas chromatographic--mass spectrometric investigation of hop aroma constituents in beer, J. Agric. Food Chem., 1978, 26, 6, 1422-1426, https://doi.org/10.1021/jf60220a037 . [all data]