Propanal, 2-methyl-3-phenyl-

Van Den Dool and Kratz RI, non-polar column, temperature ramp

View large format table.

Column type Active phase I Reference Comment
CapillaryHP-5MS1244.4Zeng, Zhao, et al., 200730. m/0.25 mm/0.25 μm, He, 4. K/min; Tstart: 80. C; Tend: 300. C

References

Zeng, Zhao, et al., 2007
Zeng, Y.-X.; Zhao, C.-X.; Liang, Y.-Z.; Yang, H.; Fang, H.-Z.; Yi, L.-Z.; Zeng, Z.-D., Comparative analysis of volatile components from Clematis species growing in China, Anal. Chim. Acta., 2007, 595, 1-2, 328-339, https://doi.org/10.1016/j.aca.2006.12.022 . [all data]