13-Methylhentriacontane

Van Den Dool and Kratz RI, non-polar column, temperature ramp

Data compiled by: NIST Mass Spectrometry Data Center, William E. Wallace, director

Column type CapillaryCapillaryCapillaryCapillary
Active phase DB-5MSUltra-1HT-5HT-5
Column length (m) 30.12.25.25.
Carrier gas He N2N2
Substrate
Column diameter (mm) 0.320.20.530.53
Phase thickness (μm) 0.25 0.220.22
Tstart (C) 150.150.150.150.
Tend (C) 300.320.320.320.
Heat rate (K/min) 2.4.15.15.
Initial hold (min)  4.
Final hold (min)  30.20.20.
I 3132.3132.3133.3132.
ReferenceSteiner, Steidle, et al., 2005Nelson, Adams, et al., 2003Goh S.H., Ooi K.E., et al., 1993Goh S.H., Ooi K.E., et al., 1993
Comment MSDC-RI MSDC-RI MSDC-RI MSDC-RI

Van Den Dool and Kratz RI, non-polar column, custom temperature program

Data compiled by: NIST Mass Spectrometry Data Center, William E. Wallace, director

Column type CapillaryCapillary
Active phase DB-1DB-1
Column length (m) 30.30.
Carrier gas  He
Substrate
Column diameter (mm) 0.320.25
Phase thickness (μm) 0.25
Program 60C (2min) => 10C/min => 220C => 3C/min => 310C60C => 20C/min => 230C => 5C/min => 330C
I 3135.3134.
ReferenceBernier, Carlson, et al., 1998Sutton and Carlson, 1993
Comment MSDC-RI MSDC-RI

Normal alkane RI, non-polar column, temperature ramp

View large format table.

Column type Active phase I Reference Comment
CapillaryDB-13134.Steiger, Haberer, et al., 201130. m/0.25 mm/0.25 μm, Helium, 10. K/min; Tstart: 50. C; Tend: 250. C
CapillaryUltra-13130.Nelson and Charlet, 2003He, 4. K/min; Column length: 12.5 m; Column diameter: 0.2 mm; Tstart: 150. C; Tend: 320. C
CapillaryDB-53130.Juárez, Blomquist, et al., 2001He, 3. K/min; Column length: 30. m; Column diameter: 0.32 mm; Tstart: 200. C; Tend: 280. C
CapillaryDB-13131.Katritzky, Chen, et al., 200030. m/0.32 mm/0.25 μm; Tstart: 60. C; Tend: 320. C
CapillaryBP-13126.Lockey and Oraha, 199012. m/0.22 mm/0.25 μm, Helium, 2. K/min; Tstart: 100. C; Tend: 300. C
CapillaryBP-13131.Lockey and Oraha, 199012. m/0.22 mm/0.25 μm, Helium, 2. K/min; Tstart: 100. C; Tend: 300. C
PackedOV-1013127.Nelson, de Renobales, et al., 1989Helium, Gas-Chrom Q (100-120 mesh), 3. K/min, 320. C @ 25. min; Column length: 3. m; Tstart: 150. C
CapillaryDexsil 3003130.Lockey, 19785. K/min; Column length: 15. m; Tstart: 50. C; Tend: 370. C
CapillaryDexsil 3003130.Lockey, 19785. K/min; Column length: 15. m; Tstart: 50. C; Tend: 370. C
PackedDexsil 3003126.Lockey, 1976Nitrogen, Chromosorb W (80-100 mesh), 3.3 K/min; Column length: 2. m; Tstart: 80. C; Tend: 340. C

Normal alkane RI, non-polar column, custom temperature program

View large format table.

Column type Active phase I Reference Comment
CapillaryPolydimethyl siloxane3131.Junkes, Castanho, et al., 2003Program: not specified
CapillaryMethyl Silicone3132.Sullivan, 2002Program: not specified
CapillaryDB-13135.Carlson, Geden, et al., 199930. m/0.32 mm/0.25 μm, He; Program: 60C (2min) => 10C/min => 220C => 3C/min => 310C (12 - 42 min)
CapillaryCP Sil 5 CB3131.Kenig, Sinninghe Damsté, et al., 199525. m/0.32 mm/0.2 μm, He; Program: 50C => 20C/min => 130C => 4C/min => 300C (20min)
CapillaryDexsil 3003132.Lockey, 1981Column length: 15. m; Program: 50 0C 5 0C/min -> 200 0C 2 0C/min -> 340 0C

References

Steiner, Steidle, et al., 2005
Steiner, S.; Steidle, J.L.M.; Ruther, J., Female sex pheromone in immature insect males - a case of pre-emergence chemical mimicry?, Behavioral Ecology and Sociobiology, 2005, 58, 2, 111-120, https://doi.org/10.1007/s00265-005-0930-x . [all data]

Nelson, Adams, et al., 2003
Nelson, D.R.; Adams, T.S.; Fatland, C.L., Hydrocarbons in the surface wax of eggs and adults of the Colorado potato beetle, Leptinotarsa decemlineata, Comp. Biochem. Physiol. B: Comp. Biochem., 2003, 134, 3, 447-466, https://doi.org/10.1016/S1096-4959(02)00262-2 . [all data]

Goh S.H., Ooi K.E., et al., 1993
Goh S.H.; Ooi K.E.; Chuah C.H.; Yong H.S.; Khoo S.G.; Ong S.H., Cuticular hydrocarbons from two species of Malaysian Bactrocera fruit flies, Biochem. Syst. Ecol., 1993, 21, 2, 215-226, https://doi.org/10.1016/0305-1978(93)90039-T . [all data]