3-Methyltricosane

Kovats' RI, non-polar column, isothermal

Data compiled by: NIST Mass Spectrometry Data Center, William E. Wallace, director

Column type CapillaryCapillaryCapillary
Active phase DB-1Dexsil 300Dexsil 300
Column length (m) 30.30.30.
Carrier gas ArHeHe
Substrate
Column diameter (mm) 0.280.300.30
Phase thickness (μm)
Temperature (C) 250.210.210.
I 2374.2366.2372.
ReferenceSzafranek, Malinski, et al., 2001Szafranek, Kusmierz, et al., 1982Szafranek, Kusmierz, et al., 1982
Comment MSDC-RI MSDC-RI MSDC-RI

Kovats' RI, non-polar column, custom temperature program

Data compiled by: NIST Mass Spectrometry Data Center, William E. Wallace, director

Column type Capillary
Active phase HP-5MS
Column length (m) 30.
Carrier gas He
Substrate
Column diameter (mm) 0.25
Phase thickness (μm) 0.25
Program 60C(1.5min) => 20C/min => 130C => 4C/min => 315C (90min)
I 2372.
ReferenceKenig, Simons, et al., 2005
Comment MSDC-RI

References

Szafranek, Malinski, et al., 2001
Szafranek, B.; Malinski, E.; Nawrot, J.; Sosnowska, D.; Ruszkowska, M.; Pihlaja, K.; Trumpakaj, Z.; Szafranek, J., In Vitro effects of cuticular lipids of the aphids Sitobion avenae, Hyalopterus pruni and Brevicoryne brassicae on growth and sporulation of the Paecilomyces fumosoroseus and Beauveria bassiana, Arkivoc, 2001, 2001, 3, 81-94, https://doi.org/10.3998/ark.5550190.0002.311 . [all data]

Szafranek, Kusmierz, et al., 1982
Szafranek, J.; Kusmierz, J.; Czerwiec, W., Gas chromatographic-mass spectrometric investigations of high-boiling crude oil alkane fractions, J. Chromatogr., 1982, 245, 2, 219-228, https://doi.org/10.1016/S0021-9673(00)88591-X . [all data]