Z,Z-2,13-Octadecadien-1-ol

Van Den Dool and Kratz RI, non-polar column, custom temperature program

View large format table.

Column type Active phase I Reference Comment
CapillaryDB-52077.Takacs, Gries, et al., 2001Column length: 30. m; Program: 100C(1min) => 20C/min => 210C => 5C/min => 240C

Normal alkane RI, non-polar column, temperature ramp

View large format table.

Column type Active phase I Reference Comment
CapillaryEC-52078.Reboucas, Sant-Ana, et al., 200730. m/0.25 mm/0.25 μm, He, 100. C @ 1. min, 10. K/min; Tend: 250. C

Normal alkane RI, polar column, temperature ramp

View large format table.

Column type Active phase I Reference Comment
CapillaryAT-Wax2192.Reboucas, Sant-Ana, et al., 200730. m/0.25 mm/0.25 μm, He, 100. C @ 1. min, 10. K/min; Tend: 250. C

References

Takacs, Gries, et al., 2001
Takacs, S.; Gries, G.; Gries, R., Communication ecology of webbing clothes moth: 4. Identification of male- and female-produced pheromones, Chemoecology, 2001, 11, 4, 153-159, https://doi.org/10.1007/PL00001846 . [all data]

Reboucas, Sant-Ana, et al., 2007
Reboucas, L.M.; Sant-Ana, A.E.G.; Griepink, F.C., Kovats retention indexes of mono- and di-unsaturated C18 alcohols, acetates and aldehydes found in Lepidopteran pheromone blends in XVI International Plant Protection Congress. Congress Proceedings. Vol.2, Scottish Exhibition and Conference Centre, Glagow, Scotland, UK, 15-18 October, 2007, 2007, 590-591. [all data]