Dihydroqinghaosu

Kovats' RI, non-polar column, custom temperature program

View large format table.

Column type Active phase I Reference Comment
CapillaryDB-51964.Roscigno, 199830. m/0.25 mm/0.25 μm; Program: 50C(5min) => 2C/min => 250C (60min) => 2C/min => 270C => 1C/min => 290C

References

Roscigno, 1998
Roscigno, G., Estrazione supercritica di principi farmaceutici e biopesticidi, Tesi di Laurea, Universita degli Studi di Salerno, Salerno, Italy, 1998, 121. [all data]