Neryl phenylacetate

Normal alkane RI, non-polar column, temperature ramp

View large format table.

Column type Active phase I Reference Comment
CapillaryDB-11953.Tohar, Mohd, et al., 200630. m/0.32 mm/0.25 μm, 60. C @ 3. min, 3. K/min, 230. C @ 10. min

References

Tohar, Mohd, et al., 2006
Tohar, N.; Mohd, M.A.; Jantan, I.; Awang, K., A comparative study of the essential oils of the genus Plumeria Linn. from Malaysia, Flavour Fragr. J., 2006, 21, 6, 859-863, https://doi.org/10.1002/ffj.1617 . [all data]