9-Docosenoic acid, methyl ester

Kovats' RI, non-polar column, isothermal

Data compiled by: NIST Mass Spectrometry Data Center, William E. Wallace, director

Column type Packed
Active phase SE-30
Column length (m) 1.5
Carrier gas He
Substrate Chromosorb W (80-100 mesh)
Column diameter (mm)
Phase thickness (μm)
Temperature (C) 200.
I 2479.
ReferenceGolovnya and Kuzmenko, 1977
Comment MSDC-RI

References

Golovnya and Kuzmenko, 1977
Golovnya, R.V.; Kuzmenko, T.E., Thermodynamic evaluation of the interaction of fatty acid methyl esters with polar and non-polar stationary phases, based on their retention indices, Chromatographia, 1977, 10, 9, 545-548, https://doi.org/10.1007/BF02262915 . [all data]