5-Eicosenoic acid, methyl ester

Kovats' RI, non-polar column, isothermal

View large format table.

Column type Active phase Temperature (C) I Reference Comment
PackedSE-30200.2281.Golovnya and Kuzmenko, 1977He, Chromosorb W (80-100 mesh); Column length: 1.5 m

References

Golovnya and Kuzmenko, 1977
Golovnya, R.V.; Kuzmenko, T.E., Thermodynamic evaluation of the interaction of fatty acid methyl esters with polar and non-polar stationary phases, based on their retention indices, Chromatographia, 1977, 10, 9, 545-548, https://doi.org/10.1007/BF02262915 . [all data]