4,7,10,13,16,19-Docosahexaenoic acid, methyl ester

Kovats' RI, non-polar column, isothermal

View large format table.

Column type Active phase Temperature (C) I Reference Comment
PackedSE-30200.2409.Golovnya and Kuzmenko, 1977He, Chromosorb W (80-100 mesh); Column length: 1.5 m
PackedSE-30200.2409.Golovnya, Uralets, et al., 1976Gas Chrom Q (80-100 mesh); Column length: 1.5 m

References

Golovnya and Kuzmenko, 1977
Golovnya, R.V.; Kuzmenko, T.E., Thermodynamic evaluation of the interaction of fatty acid methyl esters with polar and non-polar stationary phases, based on their retention indices, Chromatographia, 1977, 10, 9, 545-548, https://doi.org/10.1007/BF02262915 . [all data]

Golovnya, Uralets, et al., 1976
Golovnya, R.V.; Uralets, V.P.; Kuzmenko, T.E., Characterization of fatty acid methyl esters by gas chromatography on siloxane liquid phases, J. Chromatogr., 1976, 121, 1, 118-121, https://doi.org/10.1016/S0021-9673(00)82312-2 . [all data]