cis-5-Hexadecene

Kovats' RI, non-polar column, isothermal

Data compiled by: NIST Mass Spectrometry Data Center, William E. Wallace, director

Column type CapillaryCapillaryCapillaryCapillary
Active phase ApolaneApiezon LSqualaneSqualane
Column length (m) 250.250.
Carrier gas N2 or H2N2 or H2
Substrate
Column diameter (mm) 0.250.25
Phase thickness (μm)
Temperature (C) 160.154.130.130.
I 1575.21576.61572.1573.
ReferenceSoják, Krupcík, et al., 1980Soják, Krupcík, et al., 1980Soják, Hrivnák, et al., 1974Soják, Hrivnák, et al., 1974
Comment MSDC-RI MSDC-RI MSDC-RI MSDC-RI

References

Soják, Krupcík, et al., 1980
Soják, L.; Krupcík, J.; Janák, J., Gas chromatography of all C15-C18 linear alkenes on capillary columns with very high resolution power, J. Chromatogr., 1980, 195, 1, 43-64, https://doi.org/10.1016/S0021-9673(00)81542-3 . [all data]

Soják, Hrivnák, et al., 1974
Soják, L.; Hrivnák, J.; Ostrovský, I.; Janák, J., Capillary Gas Chromatography of Linear Alkenes on Squalane. Separation and Identification of n-Pentadecenes and n-Hexadecenes, J. Chromatogr., 1974, 91, 613-622, https://doi.org/10.1016/S0021-9673(01)97942-7 . [all data]