cis,cis,trans-3-Ethyl-1,2-dimethylcyclopentane

Kovats' RI, non-polar column, isothermal

Data compiled by: NIST Mass Spectrometry Data Center, William E. Wallace, director

Column type CapillaryCapillaryCapillaryCapillaryCapillary
Active phase SqualaneSqualaneVacuum Grease Oil (VM-4)Vacuum Grease Oil (VM-4)Vacuum Grease Oil (VM-4)
Column length (m) 50.50.
Carrier gas HeHe
Substrate
Column diameter (mm) 0.220.22
Phase thickness (μm)
Temperature (C) 50.70.35.45.50.
I 875.7880.5874.878.879.
ReferenceLunskii and Paizanskaya, 1988Lunskii and Paizanskaya, 1988Sidorov, Petrova, et al., 1972Sidorov, Petrova, et al., 1972Sidorov, Petrova, et al., 1972
Comment MSDC-RI MSDC-RI MSDC-RI MSDC-RI MSDC-RI
Column type CapillaryCapillary
Active phase Vacuum Grease Oil (VM-4)Vacuum Grease Oil (VM-4)
Column length (m)
Carrier gas
Substrate
Column diameter (mm)
Phase thickness (μm)
Temperature (C) 58.68.
I 882.885.
ReferenceSidorov, Petrova, et al., 1972Sidorov, Petrova, et al., 1972
Comment MSDC-RI MSDC-RI

References

Lunskii and Paizanskaya, 1988
Lunskii, M.Kh.; Paizanskaya, I.L., Identification of hydrocarbons C1-C9 of petrol fractions of oils and condensates in the use of capillary columns with dinonylphthalate, Zh. Anal. Khim., 1988, 43, 127-135. [all data]

Sidorov, Petrova, et al., 1972
Sidorov, R.I.; Petrova, V.I.; Ivanova, M.P., Qualitative analysis of wide-boiling fraction C5-C10 with capillary chromatography in Processes in chromatographic columns. Vol.17, 1972, 14-25. [all data]