trans-2-hydroxymenthol

Kovats' RI, non-polar column, isothermal

View large format table.

Column type Active phase Temperature (C) I Reference Comment
PackedApiezon L130.1412.Paris and Alexandre, 1972Chromosorb W AW

References

Paris and Alexandre, 1972
Paris, C.; Alexandre, P., Stereochemical Investigation of Cyclohexane and Terpene Compounds by Gas Chromatography, J. Chromatogr. Sci., 1972, 10, 6, 402-411, https://doi.org/10.1093/chromsci/10.6.402 . [all data]