uridine, TMS

Kovats' RI, non-polar column, isothermal

View large format table.

Column type Active phase Temperature (C) I Reference Comment
PackedOV-1230.2449.Quilliam and Westmore, 1978Gas Chrom Q; Column length: 1. m

Van Den Dool and Kratz RI, non-polar column, temperature ramp

View large format table.

Column type Active phase I Reference Comment
PackedOV-12460.Butts, 1972He, Chromosorb W HP (80-100 mesh), 10. K/min; Column length: 2. m; Tstart: 100. C; Tend: 325. C

Van Den Dool and Kratz RI, non-polar column, custom temperature program

View large format table.

Column type Active phase I Reference Comment
PackedSE-302466.Butts, 1970He, Chromosorb W; Column length: 2. m; Program: not specified

References

Quilliam and Westmore, 1978
Quilliam, M.A.; Westmore, J.B., Sterically crowded trialkylsilyl derivatives for chromatography and mass spectrometry of biologically-important compounds, Anal. Chem., 1978, 50, 1, 59-68, https://doi.org/10.1021/ac50023a020 . [all data]

Butts, 1972
Butts, W.C., Two-Column Gas Chromatography of Trimethylsilyl Derivatives of Biochemically Significant Compounds, Anal. Biochemistry, 1972, 46, 1, 187-199, https://doi.org/10.1016/0003-2697(72)90411-3 . [all data]

Butts, 1970
Butts, W.C., Gas chromatographic separation of trimethylsilyl (TMS)-nucleosides: TMS-methoxime derivatives of cytidine and deoxycytidine, J. Chromatogr. Sci., 1970, 8, 8, 474-476, https://doi.org/10.1093/chromsci/8.8.474 . [all data]