5,6-Dihydrouracil, TMS

Kovats' RI, non-polar column, custom temperature program

View large format table.

Column type Active phase I Reference Comment
PackedOV-11463.Yamaji, Kimura, et al., 1978Gas Chrom Q; Column length: 1. m; Program: not specified
PackedOV-11467.Yamaji, Kimura, et al., 1978Gas Chrom Q; Column length: 1. m; Program: not specified
PackedOV-11467.Yamaji, Kimura, et al., 1978Gas Chrom Q; Column length: 1. m; Program: not specified

Van Den Dool and Kratz RI, non-polar column, temperature ramp

View large format table.

Column type Active phase I Reference Comment
PackedOV-11474.Butts, 1972He, Chromosorb W HP (80-100 mesh), 10. K/min; Column length: 2. m; Tstart: 100. C; Tend: 325. C

References

Yamaji, Kimura, et al., 1978
Yamaji, A.; Kimura, S.; Kawasaki, H.; Yuki, H., Gas chromatographic analysis of pyrimidine and purine bases by retention indices, Yakugaku Zasshi, 1978, 98, 1, 1536-1541. [all data]

Butts, 1972
Butts, W.C., Two-Column Gas Chromatography of Trimethylsilyl Derivatives of Biochemically Significant Compounds, Anal. Biochemistry, 1972, 46, 1, 187-199, https://doi.org/10.1016/0003-2697(72)90411-3 . [all data]