cis,cis,trans-2-Ethyl-1,3-dimethylcyclopentane

Kovats' RI, non-polar column, isothermal

View large format table.

Column type Active phase Temperature (C) I Reference Comment
CapillarySqualane50.871.1Lunskii and Paizanskaya, 1988He; Column length: 50. m; Column diameter: 0.22 mm
CapillarySqualane70.876.1Lunskii and Paizanskaya, 1988He; Column length: 50. m; Column diameter: 0.22 mm
CapillaryVacuum Grease Oil (VM-4)35.870.Sidorov, Petrova, et al., 1972
CapillaryVacuum Grease Oil (VM-4)45.874.Sidorov, Petrova, et al., 1972
CapillaryVacuum Grease Oil (VM-4)50.875.Sidorov, Petrova, et al., 1972
CapillaryVacuum Grease Oil (VM-4)58.878.Sidorov, Petrova, et al., 1972
CapillaryVacuum Grease Oil (VM-4)68.880.Sidorov, Petrova, et al., 1972
PackedVacuum Grease Oil (VM-4)35.870.Sidorov, Ivanova, et al., 1971

References

Lunskii and Paizanskaya, 1988
Lunskii, M.Kh.; Paizanskaya, I.L., Identification of hydrocarbons C1-C9 of petrol fractions of oils and condensates in the use of capillary columns with dinonylphthalate, Zh. Anal. Khim., 1988, 43, 127-135. [all data]

Sidorov, Petrova, et al., 1972
Sidorov, R.I.; Petrova, V.I.; Ivanova, M.P., Qualitative analysis of wide-boiling fraction C5-C10 with capillary chromatography in Processes in chromatographic columns. Vol.17, 1972, 14-25. [all data]

Sidorov, Ivanova, et al., 1971
Sidorov, R.I.; Ivanova, M.P.; Petrova, V.I., Temperature dependence of cycloalkane's retention and its using in identification of structure, Gazovaya Khromatografiya, 1971, 15, 18-26. [all data]