B-Cortolone MO TMS

Kovats' RI, non-polar column, isothermal

Data compiled by: NIST Mass Spectrometry Data Center, William E. Wallace, director

Column type Capillary
Active phase OV-1
Column length (m) 20.
Carrier gas He
Substrate
Column diameter (mm) 0.25
Phase thickness (μm)
Temperature (C) 255.
I 3096.
ReferenceLuyten and Rutten, 1974
Comment MSDC-RI

Van Den Dool and Kratz RI, non-polar column, temperature ramp

Data compiled by: NIST Mass Spectrometry Data Center, William E. Wallace, director

Column type PackedPackedPackedCapillaryCapillary
Active phase OV-101SE-30OV-1OV-1SE-30
Column length (m) 3.63.620.20.20.
Carrier gas   HeHeHe
Substrate Gas-Chrom P (80-100 mesh)Gas-Chrom P (80-100 mesh)
Column diameter (mm)   0.250.250.25
Phase thickness (μm)
Tstart (C) 180.180.180.220.200.
Tend (C)
Heat rate (K/min) 1.1.1.1.1.
Initial hold (min)
Final hold (min)
I 3102.3070.3079.3095.3095.
ReferenceHurter and van Ree, 1979Hurter and van Ree, 1979Luyten and Rutten, 1974Luyten and Rutten, 1974Luyten and Rutten, 1974
Comment MSDC-RI MSDC-RI MSDC-RI MSDC-RI MSDC-RI
Column type Packed
Active phase SE-30
Column length (m) 20.
Carrier gas He
Substrate
Column diameter (mm) 0.25
Phase thickness (μm)
Tstart (C) 180.
Tend (C)
Heat rate (K/min) 1.
Initial hold (min)
Final hold (min)
I 3080.
ReferenceLuyten and Rutten, 1974
Comment MSDC-RI

References

Luyten and Rutten, 1974
Luyten, J.A.; Rutten, G.A.F.M., Analysis of Steroids by High-Resolution Gas-Liquid Chromatography. II. Application to Urinary Samples, J. Chromatogr., 1974, 91, 393-406, https://doi.org/10.1016/S0021-9673(01)97918-X . [all data]