2-Chlorononanoic acid, methyl ester

Kovats' RI, non-polar column, isothermal

Data compiled by: NIST Mass Spectrometry Data Center, William E. Wallace, director

Column type CapillaryCapillaryCapillaryPacked
Active phase SE-30SE-30SE-30E-301
Column length (m) 25.25.25.2.
Carrier gas N2N2N2He
Substrate    Celite 545 (0.20-0.50 mm)
Column diameter (mm) 0.220.220.22
Phase thickness (μm)
Temperature (C) 100.120.140.170.
I 1347.1357.1351.1358.
ReferenceHaken and Korhonen, 1984Haken and Korhonen, 1984Haken and Korhonen, 1984Shashkova, Znamenskaia, et al., 1969
Comment MSDC-RI MSDC-RI MSDC-RI MSDC-RI

References

Haken and Korhonen, 1984
Haken, J.K.; Korhonen, I.O.O., Gas chromatography of homologous esters. XXV. Capillary column studies of monochlorinated C5-C18 n-carboxylic esters, J. Chromatogr., 1984, 298, 89-100, https://doi.org/10.1016/S0021-9673(01)92697-4 . [all data]

Shashkova, Znamenskaia, et al., 1969
Shashkova, A.A.; Znamenskaia, A.P.; Pas'ko, L.Ya., Investigation of esters of odd series halohenated acids with Kovats indices, Gazovaya Khromatografiya, 1969, 9, 40-47. [all data]