Heptanoic acid, 7-chloro, ethyl ester

Kovats' RI, non-polar column, isothermal

View large format table.

Column type Active phase Temperature (C) I Reference Comment
PackedE-301170.1339.Shashkova, Znamenskaia, et al., 1969He, Celite 545 (0.20-0.50 mm); Column length: 2. m

Kovats' RI, polar column, isothermal

View large format table.

Column type Active phase Temperature (C) I Reference Comment
PackedPolyethylene Glycol170.1880.Shashkova, Znamenskaia, et al., 1969He, Celite 545 (0.20-0.50 mm); Column length: 2. m

References

Shashkova, Znamenskaia, et al., 1969
Shashkova, A.A.; Znamenskaia, A.P.; Pas'ko, L.Ya., Investigation of esters of odd series halohenated acids with Kovats indices, Gazovaya Khromatografiya, 1969, 9, 40-47. [all data]