Tetrahydropyrane, 2-chloro, # 1

Kovats' RI, non-polar column, isothermal

View large format table.

Column type Active phase Temperature (C) I Reference Comment
PackedApiezon L170.930.Jonas, Janák, et al., 1966H2
PackedApiezon L170.945.Jonas, Janák, et al., 1966H2
PackedApiezon L170.895.Jonas, Janák, et al., 1966H2
PackedApiezon L170.910.Jonas, Janák, et al., 1966H2
PackedApiezon L170.930.Jonas, Kratochvíl, et al., 1966Column length: 2. m

References

Jonas, Janák, et al., 1966
Jonas, J.; Janák, J.; Kratochvíl, M., Structural investigations with the aid of Kovats retention index system on one (nonpolar) stationary phase, J. Gas Chromatogr., 1966, 4, 9, 332-335, https://doi.org/10.1093/chromsci/4.9.332 . [all data]

Jonas, Kratochvíl, et al., 1966
Jonas, J.; Kratochvíl, M.; Gross, H.; Janák, J., Über α-halogenäther XXV. Verwendung des Kovatsschen retentionsiondexsystems zur identifizierung von acetalen der tetrahydropyranreihe, Collect. Czech. Chem. Commun., 1966, 31, 6, 2399-2409, https://doi.org/10.1135/cccc19662399 . [all data]