3-[(1-methyl-2-oxopropyl)-dithio]-2-pentanone

Van Den Dool and Kratz RI, non-polar column, temperature ramp

View large format table.

Column type Active phase I Reference Comment
CapillaryBP-51539.Whitfield and Mottram, 1999He, 60. C @ 5. min, 4. K/min; Column length: 50. m; Column diameter: 0.32 mm; Tend: 250. C
CapillaryDB-51544.Mottram, Madruga, et al., 199530. m/0.32 mm/1. μm, He, 60. C @ 5. min, 4. K/min; Tend: 250. C
CapillaryDB-51550.Mottram, Madruga, et al., 199530. m/0.32 mm/1. μm, He, 60. C @ 5. min, 4. K/min; Tend: 250. C

Van Den Dool and Kratz RI, non-polar column, custom temperature program

View large format table.

Column type Active phase I Reference Comment
CapillarySE-541532.Hofmann, Schieberle, et al., 199630. m/0.32 mm/0.25 μm; Program: 40C(2min) => 40C/min => 50C(5min) => 6C/min => 230C(15min)

Van Den Dool and Kratz RI, polar column, custom temperature program

View large format table.

Column type Active phase I Reference Comment
CapillaryFFAP2227.Hofmann, Schieberle, et al., 199630. m/0.32 mm/0.25 μm; Program: 40C(2min) => 40C/min => 60C(5min) => 6C/min => 230C(15min)

References

Whitfield and Mottram, 1999
Whitfield, F.B.; Mottram, D.S., Investigation of the reaction between 4-hydroxy-5-methyl-3(2H)-furanone and cysteine or hydrogen sulfide at pH 4.5, J. Agric. Food Chem., 1999, 47, 4, 1626-1634, https://doi.org/10.1021/jf980980v . [all data]

Mottram, Madruga, et al., 1995
Mottram, D.S.; Madruga, M.S.; Whitfield, F.B., Some novel meatlike aroma compounds from the reactions of alkanediones with hydrogen sulfide and fuanthiols, J. Agric. Food Chem., 1995, 43, 1, 189-193, https://doi.org/10.1021/jf00049a035 . [all data]

Hofmann, Schieberle, et al., 1996
Hofmann, T.; Schieberle, P.; Grosch, W., Model studies on the oxidative stability of odor-active thiols occurring in food flavors, J. Agric. Food Chem., 1996, 44, 1, 251-255, https://doi.org/10.1021/jf9500703 . [all data]