6-acetyl-3-propionyl-morphine

Kovats' RI, non-polar column, isothermal

View large format table.

Column type Active phase Temperature (C) I Reference Comment
PackedOV-1250.2722.Machata and Vycudilik, 1980N2, Chromosorb G

References

Machata and Vycudilik, 1980
Machata, G.; Vycudilik, W., Gas chromatographic analysis of illicit heroin samples, J. Anal. Toxicol., 1980, 4, 6, 318-321, https://doi.org/10.1093/jat/4.6.318 . [all data]