Felodipine M (dehydro-desethyl, methyl ester)

Kovats' RI, non-polar column, temperature ramp

View large format table.

Column type Active phase I Reference Comment
CapillaryHP-12235.Maurer and Arlt, 199912. m/0.20 mm/0.33 μm, He, 100. C @ 3. min, 7. K/min, 310. C @ 8. min

References

Maurer and Arlt, 1999
Maurer, H.H.; Arlt, J.W., Screening procedure for detection of dihydropyridine calcium channel blocker metabolites in urine as part of a systematic toxicological analysis procedure for acidic compounds by gas chromatography-mass spectrometry after extractive methylation, J. Anal. Toxicol., 1999, 23, 2, 73-80, https://doi.org/10.1093/jat/23.2.73 . [all data]