2-Thienylmethanethiol, 5-methyl

Normal alkane RI, non-polar column, temperature ramp

Data compiled by: NIST Mass Spectrometry Data Center, William E. Wallace, director

Column type Capillary
Active phase DB-1
Column length (m) 60.
Carrier gas He
Substrate
Column diameter (mm) 0.32
Phase thickness (μm) 1.0
Tstart (C) 40.
Tend (C) 280.
Heat rate (K/min) 2.
Initial hold (min)
Final hold (min)
I 1183.
ReferenceTai and Ho, 1998
Comment MSDC-RI

References

Tai and Ho, 1998
Tai, C.-Y.; Ho, C.-T., Influence of glutathione oxidation and pH on thermal formation of Maillard-type volatile compounds, J. Agric. Food Chem., 1998, 46, 6, 2260-2265, https://doi.org/10.1021/jf971111t . [all data]