3,6-dimethyl-1,2,4,5-tetrathiane

Normal alkane RI, non-polar column, temperature ramp

Data compiled by: NIST Mass Spectrometry Data Center, William E. Wallace, director

Column type CapillaryCapillary
Active phase DB-1DB-1
Column length (m) 60.60.
Carrier gas HeHe
Substrate
Column diameter (mm) 0.320.25
Phase thickness (μm) 1.01.
Tstart (C) 40.40.
Tend (C) 280.260.
Heat rate (K/min) 2.2.
Initial hold (min)  5.
Final hold (min)  60.
I 1401.1387.
ReferenceTai and Ho, 1998Yu, Wu, et al., 1994
Comment MSDC-RI MSDC-RI

References

Tai and Ho, 1998
Tai, C.-Y.; Ho, C.-T., Influence of glutathione oxidation and pH on thermal formation of Maillard-type volatile compounds, J. Agric. Food Chem., 1998, 46, 6, 2260-2265, https://doi.org/10.1021/jf971111t . [all data]

Yu, Wu, et al., 1994
Yu, T.-H.; Wu, C.-M.; Rosen, R.T.; Hartman, T.G.; Ho, C.-T., Volatile compounds in generated from thermal degradation of alliin and deoxyalliin in an aqueous solution, J. Agric. Food Chem., 1994, 42, 1, 146-153, https://doi.org/10.1021/jf00037a026 . [all data]