Propanal, 3-(4-hydroxy-3,5-dimethoxyphenyl)

Normal alkane RI, non-polar column, temperature ramp

View large format table.

Column type Active phase I Reference Comment
CapillaryZB-51836.Harrison and Priest, 200930. m/0.25 mm/0.25 μm, Helium, 40. C @ 1. min, 6. K/min, 280. C @ 9. min
CapillaryDB-11753.Kjällstrand, Ramnäs, et al., 199830. m/0.25 mm/0.25 μm, He, 5. K/min; Tstart: 50. C; Tend: 200. C

References

Harrison and Priest, 2009
Harrison, B.M.; Priest, F.G., Composition of peaks used in the preparation of malt for Scotch Whisky production - influence of geographical source and extraction depth, J. Agric. Food Chem., 2009, 57, 6, 2385-2391, https://doi.org/10.1021/jf803556y . [all data]

Kjällstrand, Ramnäs, et al., 1998
Kjällstrand, J.; Ramnäs, O.; Petersson, G., Gas chromatographic and mass spectrometric analysis of 36 lignin-related methoxyphenols from uncontrolled combustion of wood, J. Chromatogr. A, 1998, 824, 2, 205-210, https://doi.org/10.1016/S0021-9673(98)00698-0 . [all data]