4-vinylsyringol

Normal alkane RI, non-polar column, custom temperature program

Data compiled by: NIST Mass Spectrometry Data Center, William E. Wallace, director

Column type Capillary
Active phase CP-Sil5 CB MS
Column length (m) 50.
Carrier gas N2
Substrate
Column diameter (mm) 0.32
Phase thickness (μm) 1.2
Program 36C => 20C/min => 85C => 1C/min => 145C => 3C/min => 250C(30min)
I 1532.
ReferenceCallemien, Dasnoy, et al., 2006
Comment MSDC-RI

References

Callemien, Dasnoy, et al., 2006
Callemien, D.; Dasnoy, S.; Collin, S., Identification of a stale-beer-like odorant in extracts of naturally aged beer, J. Agric. Food Chem., 2006, 54, 4, 1409-1413, https://doi.org/10.1021/jf051772n . [all data]