β-Bisabolen-12-ol

Van Den Dool and Kratz RI, non-polar column, temperature ramp

View large format table.

Column type Active phase I Reference Comment
CapillaryDB-51759.Isidorov, Zenkevich, et al., 199830. m/0.25 mm/0.25 μm, 3. K/min; Tstart: 50. C; Tend: 250. C

Normal alkane RI, non-polar column, temperature ramp

View large format table.

Column type Active phase I Reference Comment
CapillaryHP-5MS1760.Ghasemi, Asghari, et al., 200330. m/0.25 mm/0.25 μm, He, 4. K/min; Tstart: 60. C; Tend: 280. C

Normal alkane RI, non-polar column, custom temperature program

View large format table.

Column type Active phase I Reference Comment
CapillaryCP Sil 8 CB1760.Judpentienë and Mockutë, 200450. m/0.32 mm/0.25 μm, He; Program: 60C(2min) => 5C/min => 160C(1min) => 10C/min => 250C (5min)

References

Isidorov, Zenkevich, et al., 1998
Isidorov, V.A.; Zenkevich, I.G.; Dubis, E.N.; Slowikowski, A.; Wojciuk, E., Group identification of essential oils components using partition coefficients in a hexane-acetonitrile system, J. Chromatogr. A, 1998, 814, 1-2, 253-260, https://doi.org/10.1016/S0021-9673(98)00398-7 . [all data]

Ghasemi, Asghari, et al., 2003
Ghasemi, N.; Asghari, G.; Ardakani, M.S.; Siahpoush, A., Characterization of volatile constituents from aerial parts of varthemia persica DC (var. persica), Iran. J. Pharm. Res., 2003, 2, 241-243. [all data]

Judpentienë and Mockutë, 2004
Judpentienë, A.; Mockutë, D., Chemical composition of essential oils of Artemisia absinthium L. (wormwood) growing wild in Vilnius, Chemija, 2004, 15, 4, 64-68. [all data]