Pyrazine, 2-(2-furfuryl)-6-methyl

Normal alkane RI, non-polar column, temperature ramp

View large format table.

Column type Active phase I Reference Comment
CapillaryDB-11361.Chen and Ho, 199960. m/0.32 mm/1. μm, He, 2. K/min; Tstart: 40. C; Tend: 260. C
CapillaryDB-11361.Chen and Ho, 199860. m/0.32 mm/1.0 μm, He, 2. K/min; Tstart: 40. C; Tend: 260. C

References

Chen and Ho, 1999
Chen, J.; Ho, C.-T., Comparison of volatile generation in serine/threonine/glutamine-ribose/glucose/fructose model systems, J. Agric. Food Chem., 1999, 47, 2, 643-647, https://doi.org/10.1021/jf980771a . [all data]

Chen and Ho, 1998
Chen, J.; Ho, C.-T., Volatile compounds generated in serine-monosaccharide model systems, J. Agric. Food Chem., 1998, 46, 4, 1518-1522, https://doi.org/10.1021/jf970934f . [all data]