(Z)-12-Hexadecenyl acetate
- Formula: C18H34O2
- Molecular weight: 282.4614
- IUPAC Standard InChIKey: MGPBZLCNYHCLEI-WAYWQWQTSA-N
- Chemical structure:
- Other names: acetic acid hexadec-12-enyl ester, cis

Kovats' RI, non-polar column, isothermal

Column type | Active phase | Temperature (C) | I | Reference | Comment |
---|---|---|---|---|---|
Packed | Apiezon L | 210. | 1934. | Nedopekina, Kovalev, et al., 1981 | N2, Chromatron N-AW-HMDS; Column length: 2.5 m |

Van Den Dool and Kratz RI, non-polar column, temperature ramp

Column type | Active phase | I | Reference | Comment |
---|---|---|---|---|
Capillary | DB-5 | 2011. | Marques, McElfresh, et al., 2000 | 30. m/0.25 mm/0.25 μm, 100. C @ 1. min, 5. K/min, 275. C @ 3. min |

Van Den Dool and Kratz RI, polar column, temperature ramp

Column type | Active phase | I | Reference | Comment |
---|---|---|---|---|
Capillary | DB-Wax | 2339. | Marques, McElfresh, et al., 2000 | 30. m/0.32 mm/0.25 μm, 100. C @ 1. min, 5. K/min; Tend: 240. C |

References

Nedopekina, Kovalev, et al., 1981
Nedopekina, S.F.; Kovalev, B.G.; Kost, A.N.,
Use of Kovats indices for idetifying sex pheromones,
Chem. Nat. Compd. (Engl. Transl.), 1981, 17, 4, 376-380, https://doi.org/10.1007/BF01185272
. [all data]
Marques, McElfresh, et al., 2000
Marques, F.A.; McElfresh, J.S.; Millar, J.G.,
Kováts retention indexes of monounsaturated C12, C14, and C16 alcohols, acetates and aldehydes commonly found in lepidopteran pheromone blends,
J. Braz. Chem. Soc., 2000, 11, 6, 592-599, https://doi.org/10.1590/S0103-50532000000600007
. [all data]