Octanal, 2,4,6-trichlorophenyl hydrazone

Kovats' RI, non-polar column, custom temperature program

Data compiled by: NIST Mass Spectrometry Data Center, William E. Wallace, director

Column type Capillary
Active phase HP-5
Column length (m)
Carrier gas
Substrate
Column diameter (mm)
Phase thickness (μm)
Program not specified
I 2301.
ReferenceLehmpuhl and Birks, 1996
Comment MSDC-RI

References

Lehmpuhl and Birks, 1996
Lehmpuhl, D.W.; Birks, J.W., New gas chromatographic-electron-capture detection method for the determination of atmospheric aldehydes and ketones based on cartridge sampling and derivatization with 2,4,6-trichlorophenylhydrazine, J. Chromatogr. A, 1996, 740, 1, 71-81, https://doi.org/10.1016/0021-9673(96)00109-4 . [all data]