1,3-Benzodioxol-4-ol, 2,2-dimethyl

Van Den Dool and Kratz RI, non-polar column, temperature ramp

View large format table.

Column type Active phase I Reference Comment
Capillary5 % Phenyl methyl siloxane1277.Climent and Miranda, 1996He, 80. C @ 3. min, 20. K/min, 300. C @ 0. min; Column length: 25. m

References

Climent and Miranda, 1996
Climent, M.J.; Miranda, M.A., Gas chromatographic - mass spectrometric study of photodegradation of carbamate pesticides, J. Chromatogr. A, 1996, 738, 2, 225-231, https://doi.org/10.1016/0021-9673(96)00084-2 . [all data]