2-Octanone, 8-(3,4-methylenedioxyphenyl)

Van Den Dool and Kratz RI, non-polar column, temperature ramp

View large format table.

Column type Active phase I Reference Comment
CapillaryDB-12017.Stashenko, Villa, et al., 199560. m/0.25 mm/0.25 μm, H2, 50. C @ 5. min, 2.5 K/min; Tend: 250. C

References

Stashenko, Villa, et al., 1995
Stashenko, E.E.; Villa, H.S.; Combariza, M.Y., Comparative study of Colombian rue oils by high resolution gas chromatography using different detection systems, J. Microcolumn Sep., 1995, 7, 2, 117-122, https://doi.org/10.1002/mcs.1220070204 . [all data]