1,3-Dithiacyclopentane, 4-methyl

Normal alkane RI, non-polar column, temperature ramp

View large format table.

Column type Active phase I Reference Comment
CapillaryDB-11005.Yu, Wu, et al., 199460. m/0.25 mm/1.0 μm, He, 40. C @ 5. min, 2. K/min, 260. C @ 60. min

References

Yu, Wu, et al., 1994
Yu, T.-H.; Wu, C.-M.; Ho, C.-T., Meat-like flavor generated from thermal interactions of glucose and alliin or deoxyalliin, J. Agric. Food Chem., 1994, 42, 4, 1005-1009, https://doi.org/10.1021/jf00040a032 . [all data]