(E)-1-propenyl allyl disulfide

Van Den Dool and Kratz RI, non-polar column, temperature ramp

View large format table.

Column type Active phase I Reference Comment
CapillaryDB-11081.Pino, Fuentes, et al., 2001He, 60. C @ 4. min, 4. K/min; Column length: 30. m; Column diameter: 0.32 mm; Tend: 250. C
CapillaryDB-11087.Yu, Lin, et al., 199460. m/0.25 mm/1.0 μm, He, 40. C @ 5. min, 2. K/min, 260. C @ 60. min

Van Den Dool and Kratz RI, polar column, temperature ramp

View large format table.

Column type Active phase I Reference Comment
CapillaryHP-Innowax1533.Storsberg, Schulz, et al., 200460. m/0.25 mm/0.5 μm, H2, 10. K/min; Tstart: 35. C; Tend: 220. C
CapillaryCP-Wax 52CB1485.Kim, Wu, et al., 1995N2, 60. C @ 4. min, 2. K/min, 200. C @ 30. min; Column length: 50. m; Column diameter: 0.25 mm
CapillaryCP-Wax 52CB1485.Kim, Wu, et al., 1995N2, 60. C @ 4. min, 2. K/min, 200. C @ 30. min; Column length: 50. m; Column diameter: 0.25 mm

Normal alkane RI, non-polar column, temperature ramp

View large format table.

Column type Active phase I Reference Comment
CapillarySPB-11074.Rao, Nagender, et al., 200730. m/0.32 mm/0.25 μm, Helium, 40. C @ 2. min, 2. K/min; Tend: 220. C

Normal alkane RI, non-polar column, custom temperature program

View large format table.

Column type Active phase I Reference Comment
CapillarySPB-11086.Rao, Nagender, et al., 200730. m/0.32 mm/0.25 μm, Helium; Program: not specified
CapillaryDB-51114.Mateo and Zumalacárregui, 199650. m/0.32 mm/0.25 μm, He; Program: 40C (10min) => 3C/min => 95C => 10C/min => 270C (10min)
CapillaryDB-51117.Mateo and Zumalacárregui, 199650. m/0.32 mm/0.25 μm, He; Program: 40C (10min) => 3C/min => 95C => 10C/min => 270C (10min)
CapillaryDB-51110.Mateo and Zumalacárregui, 199650. m/0.32 mm/0.25 μm, He; Program: 40C (10min) => 3C/min => 95C => 10C/min => 270C (10min)

References

Pino, Fuentes, et al., 2001
Pino, J.A.; Fuentes, V.; Correa, M.T., Volatile constituents of Chinese chive (Allium tuberosum Rottl. ex Sprengel) and Rakkyo (Allium chinense G. Don), J. Agric. Food Chem., 2001, 49, 3, 1328-1330, https://doi.org/10.1021/jf9907034 . [all data]

Yu, Lin, et al., 1994
Yu, T.-H.; Lin, L.-Y.; Ho, C.-T., Volatile compounds of blanched, fried blanched, and baked blanched garlic slices, J. Agric. Food Chem., 1994, 42, 6, 1342-1347, https://doi.org/10.1021/jf00042a018 . [all data]

Storsberg, Schulz, et al., 2004
Storsberg, J.; Schulz, H.; Keusgen, M.; Tannous, F.; Dehmer, K.J.; Joachim Keller, E.R., Chemical characterization of interspecific hybrids between Allium cepa L. and Allium kermesinum Rchb., J. Agric. Food Chem., 2004, 52, 17, 5499-5505, https://doi.org/10.1021/jf049684a . [all data]

Kim, Wu, et al., 1995
Kim, S.M.; Wu, C.M.; Kubota, K.; Kobayashi, A., Effect of soybean oil on garlic volatile compounds isoalted by distillation, J. Agric. Food Chem., 1995, 43, 2, 449-452, https://doi.org/10.1021/jf00050a036 . [all data]

Rao, Nagender, et al., 2007
Rao, P.P.; Nagender, A.; Rao, L.J.; Rao, D.G., Studies on the effects of microwave drying and cabinet tray drying on the chemical composition of volatile oils of garlic powders, Eur. Food Res. Technol., 2007, 224, 6, 791-795, https://doi.org/10.1007/s00217-006-0364-3 . [all data]

Mateo and Zumalacárregui, 1996
Mateo, J.; Zumalacárregui, J.M., Volatile compounds in chorizo and their changes during ripening, Meat Sci., 1996, 44, 4, 255-273, https://doi.org/10.1016/S0309-1740(96)00028-9 . [all data]