1,4-Dithiane, 3,5-dimethyl, #2

Van Den Dool and Kratz RI, non-polar column, temperature ramp

View large format table.

Column type Active phase I Reference Comment
CapillaryDB-11152.Yu, Lin, et al., 199460. m/0.25 mm/1.0 μm, He, 40. C @ 5. min, 2. K/min, 260. C @ 60. min

References

Yu, Lin, et al., 1994
Yu, T.-H.; Lin, L.-Y.; Ho, C.-T., Volatile compounds of blanched, fried blanched, and baked blanched garlic slices, J. Agric. Food Chem., 1994, 42, 6, 1342-1347, https://doi.org/10.1021/jf00042a018 . [all data]