Androst-4-en-17α-methyl-17β-ol-3-one, TMS

Van Den Dool and Kratz RI, non-polar column, temperature ramp

View large format table.

Column type Active phase I Reference Comment
CapillaryUltra-22826.Daeseleire, de Guesquiere, et al., 199125. m/0.2 mm/0.33 μm, He, 5. K/min, 280. C @ 10. min; Tstart: 200. C

Normal alkane RI, non-polar column, temperature ramp

View large format table.

Column type Active phase I Reference Comment
CapillarySE-542794.Schänzer, Opfermann, et al., 19925. K/min; Column length: 17. m; Phase thickness: 0.33 μm; Tstart: 200. C; Tend: 320. C

Normal alkane RI, non-polar column, custom temperature program

View large format table.

Column type Active phase I Reference Comment
CapillaryDB-12791.Bowers and Borts, 199630. m/0.25 mm/0.1 μm, He; Program: 170C => 20C/min => 260C => 2.7C/min => 305C => 20C/min => 320C
CapillaryBPX-52797.Bowers and Borts, 199630. m/0.22 mm/0.25 μm, He; Program: 170C => 20C/min => 260C => 2.7C/min => 305C => 20C/min => 320C

References

Daeseleire, de Guesquiere, et al., 1991
Daeseleire, E.; de Guesquiere, A.; van Peteghem, C., Derivatization and gas chromatographic-mass spectrometric detection of anabolic steroid residues isolated from edible muscle tissue, J. Chromatogr., 1991, 562, 1-2, 673-679, https://doi.org/10.1016/0378-4347(91)80617-L . [all data]

Schänzer, Opfermann, et al., 1992
Schänzer, W.; Opfermann, G.; Donike, M., 17-Epimerization of 17α-methyl anabolic steroids in humans: metabolism and synthesis of 17α-hydroxy-17β-methyl steroids, Steroids, 1992, 57, 11, 537-550, https://doi.org/10.1016/0039-128X(92)90023-3 . [all data]

Bowers and Borts, 1996
Bowers, L.D.; Borts, D.J., Separation and confirmation of anabolic steroids with quadrupole ion trap tandem mass spectrometry, J. Chromatogr. B, 1996, 687, 1, 69-78, https://doi.org/10.1016/S0378-4347(96)00231-9 . [all data]