β-Testosterone, TMS

Kovats' RI, non-polar column, isothermal

View large format table.

Column type Active phase Temperature (C) I Reference Comment
PackedOV-1210.2630.Brooks, Thawley, et al., 1971

Van Den Dool and Kratz RI, non-polar column, temperature ramp

View large format table.

Column type Active phase I Reference Comment
CapillaryHP-12606.Schänzer, Horning, et al., 199517. m/0.2 mm/0.11 μm, He, 5. K/min; Tstart: 180. C; Tend: 320. C

References

Brooks, Thawley, et al., 1971
Brooks, C.J.W.; Thawley, A.R.; Rocher, P.; Middleditch, B.S.; Anthony, G.M.; Stillwell, W.G., Characterization of Steroidal Drug Metabolites by Combined Gas Chromatography-Mass Spectrometry, J. Chromatogr. Sci., 1971, 9, 1, 35-43, https://doi.org/10.1093/chromsci/9.1.35 . [all data]

Schänzer, Horning, et al., 1995
Schänzer, W.; Horning, S.; Donike, M., Metabolism of anabolic steroids in humans: Synthesis of 6β-hydroxy metabolites of 4-chloro-1,2-dehydro-17α -methyltestosterone, fluoxymesterone, and metandienone, Steroids, 1995, 60, 4, 353-366, https://doi.org/10.1016/0039-128X(95)00008-E . [all data]