cis-Chrysanthenyl pentanoate

Normal alkane RI, non-polar column, custom temperature program

View large format table.

Column type Active phase I Reference Comment
CapillaryMethyl Silicone1500.Vernin and Merad, 1994Program: not specified

References

Vernin and Merad, 1994
Vernin, G.; Merad, L.O., Mass Spectra and Kovats Indices of Some New cis-Chrysanthenyl Esters Found in the Essential Oil of Artemisia herba alba from Algeria, J. Essent. Oil Res., 1994, 6, 4, 437-448, https://doi.org/10.1080/10412905.1994.9698419 . [all data]