Furan, 3-(ethylthio)-2-methyl

Van Den Dool and Kratz RI, non-polar column, temperature ramp

View large format table.

Column type Active phase I Reference Comment
CapillaryDB-11005.Rochat S., de Saint Laumer J.Y., et al., 200720. m/0.18 mm/0.18 μm, 60. C @ 3. min, 8. K/min, 220. C @ 5. min

Van Den Dool and Kratz RI, polar column, temperature ramp

View large format table.

Column type Active phase I Reference Comment
CapillaryDB-Wax1388.Ruther and Baltes, 199460. m/0.25 mm/0.25 μm, He, 35. C @ 5. min, 2. K/min, 210. C @ 30. min

Normal alkane RI, non-polar column, custom temperature program

View large format table.

Column type Active phase I Reference Comment
CapillaryDB-11007.Ruther and Baltes, 199460. m/0.32 mm/1.0 μm, He; Program: 35 0C (5 min), 2 0C/min to 150 0C, 3 0C/min to 260 0C (30 min)

References

Rochat S., de Saint Laumer J.Y., et al., 2007
Rochat S.; de Saint Laumer J.Y.; Chaintreau A., Analysis of sulfur compounds from the in-oven roast beef aroma by comprehensive two-dimensional gas chromatography, J. Chromatogr. A, 2007, 1147, 1, 85-94, https://doi.org/10.1016/j.chroma.2007.02.039 . [all data]

Ruther and Baltes, 1994
Ruther, J.; Baltes, W., Sulfur-containing furans in commercial meat flavorings, J. Agric. Food Chem., 1994, 42, 10, 2254-2259, https://doi.org/10.1021/jf00046a032 . [all data]