GA87, MeTMSi

Kovats' RI, non-polar column, custom temperature program

View large format table.

Column type Active phase I Reference Comment
CapillaryDB-12848.Nakayama, Yokota, et al., 1996He; Column length: 15. m; Column diameter: 0.258 mm; Program: 130C (2min) => 32C/min => 220C (4min) => 8C/min => 270C (5min)

Van Den Dool and Kratz RI, non-polar column, custom temperature program

View large format table.

Column type Active phase I Reference Comment
CapillaryXTI-52894.Blake, Browning G., et al., 200030. m/0.25 mm/0.25 μm, He; Program: 60C(1min) => 20C/min => 220C => 4C/min => 300C
CapillaryXTI-52895.Blake, Browning G., et al., 200030. m/0.25 mm/0.25 μm, He; Program: 60C(1min) => 20C/min => 220C => 4C/min => 300C
CapillaryCP Sil 5 CB2865.Blake and Browning, 1994He; Column length: 25. m; Column diameter: 0.25 mm; Program: 50C(1min) => 15C/min => 220C => 2C/min => 300C
CapillaryCP Sil 5 CB2865.Blake and Browning, 1994He; Column length: 25. m; Column diameter: 0.25 mm; Program: 50C(1min) => 15C/min => 220C => 2C/min => 300C
CapillaryDB-12854.Pearce, Koshioka, et al., 199415. m/0.22 mm/0.25 μm; Program: 60(0.1 min)-200 0C at 20 deg/min; 200-300 0C at 5 deg/min

Normal alkane RI, non-polar column, custom temperature program

View large format table.

Column type Active phase I Reference Comment
CapillaryDB-12853.Nakayama, Koshioka, et al., 200130. m/0.25 mm/0.25 μm, He; Program: 60C (2min) => 2C/min => 210C => 2C/min => 280C(5min)

References

Nakayama, Yokota, et al., 1996
Nakayama, M.; Yokota, T.; Sohma, R.; Mander, L.N.; Twitchin, B.; Komatsu, H.; Matsui, H.; Bukovac, M.J., Gibberellins in immature seed of Prunus cerasus: structure determination and synthesis of gibberellin, GA95 (1,2-didehydro-GA20), Phytochemistry, 1996, 42, 4, 913-920, https://doi.org/10.1016/0031-9422(96)00035-0 . [all data]

Blake, Browning G., et al., 2000
Blake, P.S.; Browning G.; Benjamin, L.J.; Mander, L.N., Gibberellins in seedlings and flowering trees of Prunus avium L., Phytochemistry, 2000, 53, 4, 519-528, https://doi.org/10.1016/S0031-9422(99)00597-X . [all data]

Blake and Browning, 1994
Blake, P.S.; Browning, G., Gibberellins in developing fruits of Prunus avium, Phytochemistry, 1994, 35, 6, 1383-1386, https://doi.org/10.1016/S0031-9422(00)86860-0 . [all data]

Pearce, Koshioka, et al., 1994
Pearce, D.W.; Koshioka, M.; Pharis, R.P., Chromatography of gibberellins, J. Chromatogr. A, 1994, 658, 1, 91-122, https://doi.org/10.1016/0021-9673(94)85210-3 . [all data]

Nakayama, Koshioka, et al., 2001
Nakayama, M.; Koshioka, M.; Matsui, H.; Ohara, H.; Mander, L.N.; Leitch, S.K.; Twitchin, B.; Kraft-Klaunzer, P.; Pharis, R.P.; Yokota, T., Endogenous gibberellins in immature seeds of Prunus persica L.: identification of GA118, GA119, GA120, GA121, GA122 and GA126, Phytochemistry, 2001, 57, 5, 749-758, https://doi.org/10.1016/S0031-9422(01)00154-6 . [all data]