GA85, MeTMSi

Van Den Dool and Kratz RI, non-polar column, custom temperature program

View large format table.

Column type Active phase I Reference Comment
CapillaryXTI-52858.Blake, Browning G., et al., 200030. m/0.25 mm/0.25 μm, He; Program: 60C(1min) => 20C/min => 220C => 4C/min => 300C
CapillaryCP Sil 5 CB2831.Blake and Browning, 1994He; Column length: 25. m; Column diameter: 0.25 mm; Program: 50C(1min) => 15C/min => 220C => 2C/min => 300C
CapillaryDB-12817.Pearce, Koshioka, et al., 199415. m/0.22 mm/0.25 μm; Program: 60(0.1 min)-200 0C at 20 deg/min; 200-300 0C at 5 deg/min

Normal alkane RI, non-polar column, custom temperature program

View large format table.

Column type Active phase I Reference Comment
CapillaryBP-12831.Lange, Hedden, et al., 199325. m/0.25 mm/0.33 μm, He; Program: 60C(1min) => 20C/min => 240C => 4C/min => 300C

References

Blake, Browning G., et al., 2000
Blake, P.S.; Browning G.; Benjamin, L.J.; Mander, L.N., Gibberellins in seedlings and flowering trees of Prunus avium L., Phytochemistry, 2000, 53, 4, 519-528, https://doi.org/10.1016/S0031-9422(99)00597-X . [all data]

Blake and Browning, 1994
Blake, P.S.; Browning, G., Gibberellins in developing fruits of Prunus avium, Phytochemistry, 1994, 35, 6, 1383-1386, https://doi.org/10.1016/S0031-9422(00)86860-0 . [all data]

Pearce, Koshioka, et al., 1994
Pearce, D.W.; Koshioka, M.; Pharis, R.P., Chromatography of gibberellins, J. Chromatogr. A, 1994, 658, 1, 91-122, https://doi.org/10.1016/0021-9673(94)85210-3 . [all data]

Lange, Hedden, et al., 1993
Lange, T.; Hedden, P.; Graebe, J.E., Gibberellin biosynthesis in cell-free extracts from developing Cucurbita maxima embryos and the identification of new endogenous gibberellins, Planta, 1993, 189, 3, 350-358, https://doi.org/10.1007/BF00194431 . [all data]