GA84, MeTMS

Van Den Dool and Kratz RI, non-polar column, custom temperature program

View large format table.

Column type Active phase I Reference Comment
CapillaryDB-12488.Pearce, Koshioka, et al., 199415. m/0.22 mm/0.25 μm; Program: 60(0.1 min)-200 0C at 20 deg/min; 200-300 0C at 5 deg/min
CapillarySE-522468.Hedden, Hoad, et al., 199325. m/0.22 mm/0.25 μm, He; Program: 50C => 15C/min => 240C => 4C/min => 300C
CapillarySE-522468.Hedden, Hoad, et al., 199325. m/0.22 mm/0.25 μm, He; Program: 50C => 15C/min => 240C => 4C/min => 300C

Normal alkane RI, non-polar column, temperature ramp

View large format table.

Column type Active phase I Reference Comment
CapillaryDB-12466.Oyama, Yamauchi, et al., 1996160. C @ 2. min, 16. K/min; Column length: 15. m; Column diameter: 0.258 mm; Tend: 280. C

References

Pearce, Koshioka, et al., 1994
Pearce, D.W.; Koshioka, M.; Pharis, R.P., Chromatography of gibberellins, J. Chromatogr. A, 1994, 658, 1, 91-122, https://doi.org/10.1016/0021-9673(94)85210-3 . [all data]

Hedden, Hoad, et al., 1993
Hedden, P.; Hoad, G.V.; Gaskin, P.; Lewis, M.J.; Green, J.R.; Furber, M.; Mander, L.N., Kaurenoids and gibberellins, including the newly characterized gibberellin A88, in developing apple seeds, Phytochemistry, 1993, 32, 2, 231-237, https://doi.org/10.1016/S0031-9422(00)94973-2 . [all data]

Oyama, Yamauchi, et al., 1996
Oyama, N.; Yamauchi, T.; Yamane, H.; Murofushi, N.; Agatsuma, M.; Pour, M.; Mander, L.N., Identification of gibberellins and 9,15-cyclogibberellins in developing apple seeds, Biosci. Biotechnol. Biochem., 1996, 60, 2, 305-308, https://doi.org/10.1271/bbb.60.305 . [all data]