GA78, MeTMSi

Van Den Dool and Kratz RI, non-polar column, custom temperature program

View large format table.

Column type Active phase I Reference Comment
CapillaryDB-12740.Pearce, Koshioka, et al., 199415. m/0.22 mm/0.25 μm; Program: 60(0.1 min)-200 0C at 20 deg/min; 200-300 0C at 5 deg/min

References

Pearce, Koshioka, et al., 1994
Pearce, D.W.; Koshioka, M.; Pharis, R.P., Chromatography of gibberellins, J. Chromatogr. A, 1994, 658, 1, 91-122, https://doi.org/10.1016/0021-9673(94)85210-3 . [all data]