GA69, MeTMS

Van Den Dool and Kratz RI, non-polar column, custom temperature program

View large format table.

Column type Active phase I Reference Comment
CapillaryOV-12497.Davis, Kobayashi, et al., 199825. m/0.2 mm/0.25 μm, He; Program: 60C(2min) => 10min/C => 150C => 3C/min => 300C
CapillaryDB-12512.Pearce, Koshioka, et al., 199415. m/0.22 mm/0.25 μm; Program: 60(0.1 min)-200 0C at 20 deg/min; 200-300 0C at 5 deg/min

Normal alkane RI, non-polar column, custom temperature program

View large format table.

Column type Active phase I Reference Comment
CapillaryOV-12489.Yamane, Fujioka, et al., 198825. m/0.20 mm/0.25 μm; Program: not specified

References

Davis, Kobayashi, et al., 1998
Davis, G.; Kobayashi, M.; Phinney, B.O.; MacMillan, J.; Gaskin, P., The Metabolism of GA9 in maize (ZEA mays), Phytochemistry, 1998, 47, 4, 635-639, https://doi.org/10.1016/S0031-9422(97)87974-5 . [all data]

Pearce, Koshioka, et al., 1994
Pearce, D.W.; Koshioka, M.; Pharis, R.P., Chromatography of gibberellins, J. Chromatogr. A, 1994, 658, 1, 91-122, https://doi.org/10.1016/0021-9673(94)85210-3 . [all data]

Yamane, Fujioka, et al., 1988
Yamane, H.; Fujioka, S.; Spray, C.R.; Phinney, B.O.; MacMillan, J.; Gaskin, P.; Takahashi, N., Endogenous Gibberellines from Sporophytes of Two Tree Ferns, Cibotium glaucum and Dicksonia antarctica, Plant Phisiol., 1988, 86, 3, 857-862, https://doi.org/10.1104/pp.86.3.857 . [all data]