GA51, MeTMS

Normal alkane RI, non-polar column, custom temperature program

Data compiled by: NIST Mass Spectrometry Data Center, William E. Wallace, director

Column type CapillaryCapillary
Active phase OV-1Ultra-2
Column length (m)  25.
Carrier gas
Substrate
Column diameter (mm)  0.32
Phase thickness (μm)  0.52
Program not specified50C => 40C/min => 220C => 8C/min => 280C
I 2539.2490.
ReferenceSakamoto, Kobayashi, et al., 2001Talon, Zeevaart, et al., 1991
Comment MSDC-RI MSDC-RI

References

Sakamoto, Kobayashi, et al., 2001
Sakamoto, T.; Kobayashi, M.; Itoh, H.; Tahiri, A.; Kayano, T.; Tanaka, H.; Iwahori, S.; Matsuoka, M., Expression of a gibberellin 2-oxidase gene around the shoot apex is related to phase transition in rice, Plant Physiology, 2001, 125, 3, 1508-1516, https://doi.org/10.1104/pp.125.3.1508 . [all data]

Talon, Zeevaart, et al., 1991
Talon, M.; Zeevaart, J.A.D.; Gage, D.A., Identification of gibberellins in spinach and effects of light and darkness on their levels, Plant Physiol., 1991, 97, 4, 1521-1526, https://doi.org/10.1104/pp.97.4.1521 . [all data]